Target
Carbonic anhydrase 1
Ligand
BDBM50372659
Substrate
Meas. Tech.
ChEMBL_465605 (CHEMBL951055)
Ki
2.8±n/a nM
Citation
 Wilkinson, BLInnocenti, AVullo, DSupuran, CTPoulsen, SA Inhibition of carbonic anhydrases with glycosyltriazole benzene sulfonamides. J Med Chem 51:1945-53 (2008)  
Target
Name:
Carbonic anhydrase 1
Synonyms:
CA-I CAB Carbonate dehydratase I Carbonic anhydrase 1 (CA I) Carbonic anhydrase 1 (Recombinant CA I) Carbonic anhydrase B Carbonic anhydrase I (CA I) Carbonic anhydrase I (CAI) Carbonic anhydrase isoenzyme I (hCA I) | hCA
Type:
Enzyme
Mol. Mass.:
28873.37
Organism:
Homo sapiens (Human)
Description:
P00915
Residue:
261
  
Inhibitor
Name:
BDBM50372659
Synonyms:
CHEMBL259682
Type:
Small organic molecule
Emp. Form.:
C14H18N4O7S
Mol. Mass.:
386.38
SMILES:
NS(=O)(=O)c1ccc(cc1)-c1cn(nn1)[C@H]1O[C@H](CO)[C@@H](O)[C@H](O)[C@@H]1O
: