Target
Tyrosine-protein kinase Lck
Ligand
BDBM50372707
Substrate
Meas. Tech.
ChEMBL_465744 (CHEMBL948988)
IC50
41±n/a nM
Citation
 Deak, HLNewcomb, JRNunes, JJBoucher, CCheng, ACDiMauro, EFEpstein, LFGallant, PHodous, BLHuang, XLee, JHPatel, VFSchneider, STurci, SMZhu, X N-(3-(phenylcarbamoyl)arylpyrimidine)-5-carboxamides as potent and selective inhibitors of Lck: structure, synthesis and SAR. Bioorg Med Chem Lett 18:1172-6 (2008)  
Target
Name:
Tyrosine-protein kinase Lck
Synonyms:
2.7.10.2 LCK_HUMAN Leukocyte C-terminal Src kinase Lymphocyte-specific protein tyrosine kinase Protein YT16 Proto-oncogene tyrosine-protein kinase LCK T cell-specific protein-tyrosine kinase
Type:
Mol. Mass.:
57987.83
Organism:
Homo sapiens (Human)
Description:
P06239
Residue:
509
  
Inhibitor
Name:
BDBM50372707
Synonyms:
CHEMBL408292
Type:
Small organic molecule
Emp. Form.:
C32H31F3N6O4
Mol. Mass.:
620.6215
SMILES:
Cc1ccc(cc1NC(=O)c1cnc(NCCN2CCOCC2)nc1Oc1ccccc1)C(=O)Nc1cccc(c1)C(F)(F)F
: