Target
Tyrosine-protein kinase Lck
Ligand
BDBM50372716
Substrate
Meas. Tech.
ChEMBL_465744 (CHEMBL948988)
IC50
53±n/a nM
Citation
 Deak, HLNewcomb, JRNunes, JJBoucher, CCheng, ACDiMauro, EFEpstein, LFGallant, PHodous, BLHuang, XLee, JHPatel, VFSchneider, STurci, SMZhu, X N-(3-(phenylcarbamoyl)arylpyrimidine)-5-carboxamides as potent and selective inhibitors of Lck: structure, synthesis and SAR. Bioorg Med Chem Lett 18:1172-6 (2008)  
Target
Name:
Tyrosine-protein kinase Lck
Synonyms:
2.7.10.2 LCK_HUMAN Leukocyte C-terminal Src kinase Lymphocyte-specific protein tyrosine kinase Protein YT16 Proto-oncogene tyrosine-protein kinase LCK T cell-specific protein-tyrosine kinase
Type:
Mol. Mass.:
57987.83
Organism:
Homo sapiens (Human)
Description:
P06239
Residue:
509
  
Inhibitor
Name:
BDBM50372716
Synonyms:
CHEMBL271018
Type:
Small organic molecule
Emp. Form.:
C22H20F3N5O3
Mol. Mass.:
459.4211
SMILES:
CNc1ncc(C(=O)Nc2cc(ccc2C)C(=O)Nc2cccc(c2)C(F)(F)F)c(OC)n1
: