Target
Androgen receptor
Ligand
BDBM50373241
Substrate
Meas. Tech.
ChEMBL_467617 (CHEMBL930492)
Ki
27±n/a nM
Citation
 Zhao, SShen, Yvan Oeveren, AMarschke, KBZhi, L Discovery of a novel series of nonsteroidal androgen receptor modulators: 5- or 6-oxachrysen-2-ones. Bioorg Med Chem Lett 18:3431-5 (2008)  
Target
Name:
Androgen receptor
Synonyms:
ANDR_HUMAN Androgen Receptor Androgen receptor/Baculoviral IAP repeat-containing protein 2 Dihydrotestosterone receptor Nuclear receptor subfamily 3 group C member 4
Type:
Receptor
Mol. Mass.:
99185.27
Organism:
Homo sapiens (Human)
Description:
CHO cells were stably transfected with human AR gene.
Residue:
920
  
Inhibitor
Name:
BDBM50373241
Synonyms:
CHEMBL402136
Type:
Small organic molecule
Emp. Form.:
C18H12F3NO3
Mol. Mass.:
347.288
SMILES:
COc1cccc2COc3c(ccc4[nH]c(=O)cc(c34)C(F)(F)F)-c12
: