Target
Androgen receptor
Ligand
BDBM50373228
Substrate
Meas. Tech.
ChEMBL_467618 (CHEMBL930493)
IC50
1.1±n/a nM
Citation
 Zhao, SShen, Yvan Oeveren, AMarschke, KBZhi, L Discovery of a novel series of nonsteroidal androgen receptor modulators: 5- or 6-oxachrysen-2-ones. Bioorg Med Chem Lett 18:3431-5 (2008)  
Target
Name:
Androgen receptor
Synonyms:
ANDR_HUMAN Androgen Receptor Androgen receptor/Baculoviral IAP repeat-containing protein 2 Dihydrotestosterone receptor Nuclear receptor subfamily 3 group C member 4
Type:
Receptor
Mol. Mass.:
99185.27
Organism:
Homo sapiens (Human)
Description:
CHO cells were stably transfected with human AR gene.
Residue:
920
  
Inhibitor
Name:
BDBM50373228
Synonyms:
CHEMBL253535
Type:
Small organic molecule
Emp. Form.:
C17H10F3NO3
Mol. Mass.:
333.2614
SMILES:
Oc1cccc2OCc3c(ccc4[nH]c(=O)cc(c34)C(F)(F)F)-c12
: