Target
Receptor tyrosine-protein kinase erbB-2
Ligand
BDBM50373853
Substrate
Meas. Tech.
ChEMBL_468598 (CHEMBL947895)
IC50
1±n/a nM
Citation
 Ducray, RBallard, PBarlaam, BCHickinson, MDKettle, JGOgilvie, DJTrigwell, CB Novel 3-alkoxy-1H-pyrazolo[3,4-d]pyrimidines as EGFR and erbB2 receptor tyrosine kinase inhibitors. Bioorg Med Chem Lett 18:959-62 (2008)  
Target
Name:
Receptor tyrosine-protein kinase erbB-2
Synonyms:
2.7.10.1 CD_antigen=CD340 ERBB2_HUMAN FASN/HER2 HER2 MLN19 NEU Proto-oncogene Neu Tyrosine kinase-type cell surface receptor HER2 | p185erbB2
Type:
Mol. Mass.:
137894.47
Organism:
Homo sapiens (Human)
Description:
P04626
Residue:
1255
  
Inhibitor
Name:
BDBM50373853
Synonyms:
CHEMBL258282
Type:
Small organic molecule
Emp. Form.:
C24H27ClN8O2
Mol. Mass.:
494.977
SMILES:
CN1CCN(CCOc2[nH]nc3ncnc(Nc4ccc(OCc5ccccn5)c(Cl)c4)c23)CC1
: