Target
Epidermal growth factor receptor
Ligand
BDBM3303
Substrate
Meas. Tech.
ChEMBL_468986 (CHEMBL952131)
IC50
0.120226±n/a nM
Citation
 Kolb, PHuang, DDey, FCaflisch, A Discovery of kinase inhibitors by high-throughput docking and scoring based on a transferable linear interaction energy model. J Med Chem 51:1179-88 (2008)  
Target
Name:
Epidermal growth factor receptor
Synonyms:
EGF Receptor Substrate EGFR_HUMAN ERBB1 Epidermal Growth Factor Receptor erbB-1 Epidermal growth factor receptor (EGFR) HER1 Proto-oncogene c-ErbB-1 Tyrosine-Protein Kinase ErbB-1
Type:
Receptor Kinase Domain
Mol. Mass.:
134279.59
Organism:
Homo sapiens (Human)
Description:
P00533
Residue:
1210
  
Inhibitor
Name:
BDBM3303
Synonyms:
4-Anilinoquinazoline deriv. 54 4[ (3-Bromophenyl)aminol-6,7-diaminoquinazoline | CHEMBL328216
Type:
Small organic molecule
Emp. Form.:
C14H12BrN5
Mol. Mass.:
330.183
SMILES:
Nc1cc2ncnc(Nc3cccc(Br)c3)c2cc1N
: