Target
Prothrombin
Ligand
BDBM14137
Substrate
Meas. Tech.
ChEMBL_469216 (CHEMBL948917)
Ki
1.4±n/a nM
Citation
 Maryanoff, BECostanzo, MJ Inhibitors of proteases and amide hydrolases that employ an alpha-ketoheterocycle as a key enabling functionality. Bioorg Med Chem 16:1562-95 (2008)  
Target
Name:
Prothrombin
Synonyms:
Activation peptide fragment 1 Coagulation factor II Prothrombin precursor Thrombin heavy chain | Thrombin light chain
Type:
Protein
Mol. Mass.:
70029.57
Organism:
Homo sapiens (Human)
Description:
P00734
Residue:
622
  
Inhibitor
Name:
BDBM14137
Synonyms:
2-ketobenzothiazole 75 | methyl (3S)-4-[(2S)-2-{[(2S)-1-(1,3-benzothiazol-2-yl)-5-carbamimidamido-1-oxopentan-2-yl]carbamoyl}pyrrolidin-1-yl]-4-oxo-3-(2-propylpentanamido)butanoate
Type:
Small organic molecule
Emp. Form.:
C31H45N7O6S
Mol. Mass.:
643.797
SMILES:
[#6]-[#6]-[#6]-[#6](-[#6]-[#6]-[#6])-[#6](=O)-[#7]-[#6@@H](-[#6]-[#6](=O)-[#8]-[#6])-[#6](=O)-[#7]-1-[#6]-[#6]-[#6]-[#6@H]-1-[#6](=O)-[#7]-[#6@@H](-[#6]-[#6]-[#6]\[#7]=[#6](\[#7])-[#7])-[#6](=O)-c1nc2ccccc2s1
: