Target
Prothrombin
Ligand
BDBM50125025
Substrate
Meas. Tech.
ChEMBL_469216 (CHEMBL948917)
IC50
2000±n/a nM
Citation
 Maryanoff, BECostanzo, MJ Inhibitors of proteases and amide hydrolases that employ an alpha-ketoheterocycle as a key enabling functionality. Bioorg Med Chem 16:1562-95 (2008)  
Target
Name:
Prothrombin
Synonyms:
Activation peptide fragment 1 Coagulation factor II Prothrombin precursor Thrombin heavy chain | Thrombin light chain
Type:
Protein
Mol. Mass.:
70029.57
Organism:
Homo sapiens (Human)
Description:
P00734
Residue:
622
  
Inhibitor
Name:
BDBM50125025
Synonyms:
2-((S)-3-Benzyl-2-oxo-4-phenylmethanesulfonyl-piperazin-1-yl)-N-[(S)-4-guanidino-1-(thiazole-2-carbonyl)-butyl]-acetamide CHEMBL350380
Type:
Small organic molecule
Emp. Form.:
C29H35N7O5S2
Mol. Mass.:
625.762
SMILES:
NC(=N)NCCC[C@H](NC(=O)CN1CCN([C@@H](Cc2ccccc2)C1=O)S(=O)(=O)Cc1ccccc1)C(=O)c1nccs1
: