Target
Orexin receptor type 2
Ligand
BDBM50374456
Substrate
Meas. Tech.
ChEMBL_469337 (CHEMBL932891)
Ki
0.6±n/a nM
Citation
 Bergman, JMRoecker, AJMercer, SPBednar, RAReiss, DRRansom, RWMeacham Harrell, CPettibone, DJLemaire, WMurphy, KLLi, CPrueksaritanont, TWinrow, CJRenger, JJKoblan, KSHartman, GDColeman, PJ Proline bis-amides as potent dual orexin receptor antagonists. Bioorg Med Chem Lett 18:1425-30 (2008)  
Target
Name:
Orexin receptor type 2
Synonyms:
HCRTR2 OX2R_HUMAN Orexin receptor type 2 (OR-2) Orexin receptor type 2 (OX2R) Ox-2-R | Ox2-R
Type:
Protein
Mol. Mass.:
50710.53
Organism:
Homo sapiens (Human)
Description:
O43614
Residue:
444
  
Inhibitor
Name:
BDBM50374456
Synonyms:
CHEMBL256789
Type:
Small organic molecule
Emp. Form.:
C26H24N4O2S
Mol. Mass.:
456.559
SMILES:
O=C(CSc1nc2ccccc2[nH]1)N1CCC[C@H]1C(=O)Nc1ccccc1-c1ccccc1
: