Target
Synaptic vesicular amine transporter
Ligand
BDBM50017712
Substrate
Meas. Tech.
ChEMBL_469572 (CHEMBL932301)
Ki
1±n/a nM
Citation
 Wimalasena, DSPerera, RPHeyen, BJBalasooriya, ISWimalasena, K Vesicular monoamine transporter substrate/inhibitor activity of MPTP/MPP+ derivatives: a structure-activity study. J Med Chem 51:760-8 (2008)  
Target
Name:
Synaptic vesicular amine transporter
Synonyms:
Monoamine transporter Solute carrier family 18 member 2 VMAT2 Vesicular amine transporter 2
Type:
PROTEIN
Mol. Mass.:
55749.95
Organism:
Bos taurus
Description:
ChEMBL_469572
Residue:
517
  
Inhibitor
Name:
BDBM50017712
Synonyms:
(-)-reserpine 3,4,5-trimethoxybenzoyl methyl reserpate CHEMBL772 RESERPINE Serpalan methyl (3beta,16beta,17alpha,18beta,20alpha)-11,17-dimethoxy-18-[(3,4,5-trimethoxybenzoyl)oxy]yohimban-16-carboxylate
Type:
Small organic molecule
Emp. Form.:
C33H40N2O9
Mol. Mass.:
608.6787
SMILES:
CO[C@H]1[C@@H](C[C@@H]2CN3CCc4c([nH]c5cc(OC)ccc45)[C@H]3C[C@@H]2[C@@H]1C(=O)OC)OC(=O)c1cc(OC)c(OC)c(OC)c1
: