Target
Synaptic vesicular amine transporter
Ligand
BDBM50025879
Substrate
Meas. Tech.
ChEMBL_469572 (CHEMBL932301)
Ki
134000±n/a nM
Citation
 Wimalasena, DSPerera, RPHeyen, BJBalasooriya, ISWimalasena, K Vesicular monoamine transporter substrate/inhibitor activity of MPTP/MPP+ derivatives: a structure-activity study. J Med Chem 51:760-8 (2008)  
Target
Name:
Synaptic vesicular amine transporter
Synonyms:
Monoamine transporter Solute carrier family 18 member 2 VMAT2 Vesicular amine transporter 2
Type:
PROTEIN
Mol. Mass.:
55749.95
Organism:
Bos taurus
Description:
ChEMBL_469572
Residue:
517
  
Inhibitor
Name:
BDBM50025879
Synonyms:
4-(1-Methyl-1,2,3,6-tetrahydro-pyridin-4-yl)-phenol CHEMBL108967 | CHEMBL537234
Type:
Small organic molecule
Emp. Form.:
C12H15NO
Mol. Mass.:
189.2536
SMILES:
CN1CCC(=CC1)c1ccc(O)cc1
: