Target
Macrophage colony-stimulating factor 1 receptor
Ligand
BDBM27890
Substrate
Meas. Tech.
ChEMBL_470263 (CHEMBL950218)
IC50
8±n/a nM
Citation
 Huang, HHutta, DAHu, HDesJarlais, RLSchubert, CPetrounia, IPChaikin, MAManthey, CLPlayer, MR Design and synthesis of a pyrido[2,3-d]pyrimidin-5-one class of anti-inflammatory FMS inhibitors. Bioorg Med Chem Lett 18:2355-61 (2008)  
Target
Name:
Macrophage colony-stimulating factor 1 receptor
Synonyms:
CSF1R FMS Macrophage colony stimulating factor receptor Macrophage colony-stimulating factor 1 receptor (c-FMS) Proto-oncogene c-Fms c-fms | cFMS
Type:
Protein
Mol. Mass.:
107979.48
Organism:
Homo sapiens (Human)
Description:
P07333
Residue:
972
  
Inhibitor
Name:
BDBM27890
Synonyms:
8-(2,3-dihydro-1H-inden-5-yl)-2-({4-[2-(4-methylpiperazin-1-yl)ethyl]phenyl}amino)-5-oxo-5H,8H-pyrido[2,3-d]pyrimidine-6-carboxamide | Pyrido[2,3-d]pyrimidin-5-one, 17a
Type:
Small organic molecule
Emp. Form.:
C30H33N7O2
Mol. Mass.:
523.6287
SMILES:
CN1CCN(CCc2ccc(Nc3ncc4c(n3)n(cc(C(N)=O)c4=O)-c3ccc4CCCc4c3)cc2)CC1
: