Target
Macrophage colony-stimulating factor 1 receptor
Ligand
BDBM50375145
Substrate
Meas. Tech.
ChEMBL_470263 (CHEMBL950218)
IC50
5±n/a nM
Citation
 Huang, HHutta, DAHu, HDesJarlais, RLSchubert, CPetrounia, IPChaikin, MAManthey, CLPlayer, MR Design and synthesis of a pyrido[2,3-d]pyrimidin-5-one class of anti-inflammatory FMS inhibitors. Bioorg Med Chem Lett 18:2355-61 (2008)  
Target
Name:
Macrophage colony-stimulating factor 1 receptor
Synonyms:
CSF1R FMS Macrophage colony stimulating factor receptor Macrophage colony-stimulating factor 1 receptor (c-FMS) Proto-oncogene c-Fms c-fms | cFMS
Type:
Protein
Mol. Mass.:
107979.48
Organism:
Homo sapiens (Human)
Description:
P07333
Residue:
972
  
Inhibitor
Name:
BDBM50375145
Synonyms:
CHEMBL271461
Type:
Small organic molecule
Emp. Form.:
C27H27N7O2
Mol. Mass.:
481.549
SMILES:
NC(=O)c1cn(-c2ccc3CCCc3c2)c2nc(Nc3ccc(cc3)N3CCNCC3)ncc2c1=O
: