Target
Mast/stem cell growth factor receptor Kit
Ligand
BDBM50375155
Substrate
Meas. Tech.
ChEMBL_470268 (CHEMBL951154)
IC50
28±n/a nM
Citation
 Huang, HHutta, DAHu, HDesJarlais, RLSchubert, CPetrounia, IPChaikin, MAManthey, CLPlayer, MR Design and synthesis of a pyrido[2,3-d]pyrimidin-5-one class of anti-inflammatory FMS inhibitors. Bioorg Med Chem Lett 18:2355-61 (2008)  
Target
Name:
Mast/stem cell growth factor receptor Kit
Synonyms:
CD117 antigen KIT Mast/stem cell growth factor receptor Kit (cKIT) Proto-oncogene tyrosine-protein kinase Kit Stem cell growth factor receptor Tyrosine-protein kinase Kit c-kit v-kit Hardy-Zuckerman 4 feline sarcoma viral oncogene homolog
Type:
Protein
Mol. Mass.:
109869.37
Organism:
Homo sapiens (Human)
Description:
P10721
Residue:
976
  
Inhibitor
Name:
BDBM50375155
Synonyms:
CHEMBL256893
Type:
Small organic molecule
Emp. Form.:
C29H31N7O2
Mol. Mass.:
509.6021
SMILES:
CN1CCN(Cc2ccc(Nc3ncc4c(n3)n(cc(C(N)=O)c4=O)-c3ccc4CCCc4c3)cc2)CC1
: