Target
Aldo-keto reductase family 1 member C21
Ligand
BDBM16314
Substrate
Meas. Tech.
ChEMBL_470435 (CHEMBL936590)
IC50
48000±n/a nM
Citation
 Dhagat, UEndo, SHara, AEl-Kabbani, O Inhibition of 3(17)alpha-hydroxysteroid dehydrogenase (AKR1C21) by aldose reductase inhibitors. Bioorg Med Chem 16:3245-54 (2008)  
Target
Name:
Aldo-keto reductase family 1 member C21
Synonyms:
AK1CL_MOUSE | Akr1c21
Type:
PROTEIN
Mol. Mass.:
36879.72
Organism:
Mus musculus
Description:
ChEMBL_470435
Residue:
323
  
Inhibitor
Name:
BDBM16314
Synonyms:
2-{[6-methoxy-5-(trifluoromethyl)naphthalen-1-yl]-N-methylmethanethioamido}acetic acid CHEMBL436 Tolrestat
Type:
Small organic molecule
Emp. Form.:
C16H14F3NO3S
Mol. Mass.:
357.347
SMILES:
COc1ccc2c(cccc2c1C(F)(F)F)C(=S)N(C)CC(O)=O
: