Target
Aldo-keto reductase family 1 member C21
Ligand
BDBM15236
Substrate
Meas. Tech.
ChEMBL_470435 (CHEMBL936590)
IC50
12300±n/a nM
Citation
 Dhagat, UEndo, SHara, AEl-Kabbani, O Inhibition of 3(17)alpha-hydroxysteroid dehydrogenase (AKR1C21) by aldose reductase inhibitors. Bioorg Med Chem 16:3245-54 (2008)  
Target
Name:
Aldo-keto reductase family 1 member C21
Synonyms:
AK1CL_MOUSE | Akr1c21
Type:
PROTEIN
Mol. Mass.:
36879.72
Organism:
Mus musculus
Description:
ChEMBL_470435
Residue:
323
  
Inhibitor
Name:
BDBM15236
Synonyms:
3,5,7-trihydroxy-2-(3,4,5-trihydroxyphenyl)-4H-chromen-4-one CHEMBL164 Myricetin Myricetin (Myr) | cid_5281672
Type:
Small organic molecule
Emp. Form.:
C15H10O8
Mol. Mass.:
318.2351
SMILES:
Oc1cc(O)c2c(c1)oc(-c1cc(O)c(O)c(O)c1)c(O)c2=O
: