Target
Aldo-keto reductase family 1 member C21
Ligand
BDBM16452
Substrate
Meas. Tech.
ChEMBL_470435 (CHEMBL936590)
IC50
158000±n/a nM
Citation
 Dhagat, UEndo, SHara, AEl-Kabbani, O Inhibition of 3(17)alpha-hydroxysteroid dehydrogenase (AKR1C21) by aldose reductase inhibitors. Bioorg Med Chem 16:3245-54 (2008)  
Target
Name:
Aldo-keto reductase family 1 member C21
Synonyms:
AK1CL_MOUSE | Akr1c21
Type:
PROTEIN
Mol. Mass.:
36879.72
Organism:
Mus musculus
Description:
ChEMBL_470435
Residue:
323
  
Inhibitor
Name:
BDBM16452
Synonyms:
(4-oxo-3-{[5-(trifluoromethyl)-1,3-benzothiazol-2-yl]methyl}-3,4-dihydrophthalazin-1-yl)acetic acid Alond Xedia | Zopolrestat
Type:
Small organic molecule
Emp. Form.:
C19H12F3N3O3S
Mol. Mass.:
419.377
SMILES:
OC(=O)Cc1nn(Cc2nc3cc(ccc3s2)C(F)(F)F)c(=O)c2ccccc12
: