Target
Cannabinoid receptor 2
Ligand
BDBM21283
Substrate
Meas. Tech.
ChEMBL_471741 (CHEMBL921013)
IC50
3.4±n/a nM
Citation
 Ohta, HIshizaka, TTatsuzuki, MYoshinaga, MIida, IYamaguchi, TTomishima, YFutaki, NToda, YSaito, S Imine derivatives as new potent and selective CB2 cannabinoid receptor agonists with an analgesic action. Bioorg Med Chem 16:1111-24 (2008)  
Target
Name:
Cannabinoid receptor 2
Synonyms:
CANNABINOID CB2 CB2 CB2B CNR2_HUMAN Cannabinoid CB2 receptor Cannabinoid receptor 2 (CB2R) | hCB2
Type:
G Protein-Coupled Receptor (GPCR)
Mol. Mass.:
39690.94
Organism:
Homo sapiens (Human)
Description:
P34972
Residue:
360
  
Inhibitor
Name:
BDBM21283
Synonyms:
3-[(2-iodo-5-nitrophenyl)carbonyl]-1-[(1-methylpiperidin-2-yl)methyl]-1H-indole | AM1241
Type:
Small organic molecule
Emp. Form.:
C22H22IN3O3
Mol. Mass.:
503.3329
SMILES:
CN1CCCCC1Cn1cc(C(=O)c2cc(ccc2I)[N+]([O-])=O)c2ccccc12
: