Target
Cannabinoid receptor 2
Ligand
BDBM50222843
Substrate
Meas. Tech.
ChEMBL_471725 (CHEMBL920997)
EC50
10±n/a nM
Citation
 Ohta, HIshizaka, TTatsuzuki, MYoshinaga, MIida, IYamaguchi, TTomishima, YFutaki, NToda, YSaito, S Imine derivatives as new potent and selective CB2 cannabinoid receptor agonists with an analgesic action. Bioorg Med Chem 16:1111-24 (2008)  
Target
Name:
Cannabinoid receptor 2
Synonyms:
CANNABINOID CB2 CB2 CB2B CNR2_HUMAN Cannabinoid CB2 receptor Cannabinoid receptor 2 (CB2R) | hCB2
Type:
G Protein-Coupled Receptor (GPCR)
Mol. Mass.:
39690.94
Organism:
Homo sapiens (Human)
Description:
P34972
Residue:
360
  
Inhibitor
Name:
BDBM50222843
Synonyms:
CHEMBL398666 | N-(5-tert-butyl-3-(cyclopropylmethyl)-4-methylthiazol-2(3H)-ylidene)-3-(trifluoromethyl)benzamide
Type:
Small organic molecule
Emp. Form.:
C20H23F3N2OS
Mol. Mass.:
396.47
SMILES:
Cc1c(s\c(=N/C(=O)c2cccc(c2)C(F)(F)F)n1CC1CC1)C(C)(C)C
: