Target
5-hydroxytryptamine receptor 2C
Ligand
BDBM50375449
Substrate
Meas. Tech.
ChEMBL_472646 (CHEMBL921962)
Ki
20±n/a nM
Citation
 Shimada, IMaeno, KKazuta, KKubota, HKimizuka, TKimura, YHatanaka, KNaitou, YWanibuchi, FSakamoto, STsukamoto, S Synthesis and structure-activity relationships of a series of substituted 2-(1H-furo[2,3-g]indazol-1-yl)ethylamine derivatives as 5-HT2C receptor agonists. Bioorg Med Chem 16:1966-82 (2008)  
Target
Name:
5-hydroxytryptamine receptor 2C
Synonyms:
5-HT-2C 5-HT2C-INI 5-HTR2C 5-hydroxytryptamine receptor 2C (5-HT-2C) 5HT-1C HTR1C Serotonin (5-HT3) receptor Serotonin Receptor 2C
Type:
G Protein-Coupled Receptor (GPCR)
Mol. Mass.:
51836.79
Organism:
Homo sapiens (Human)
Description:
P28335
Residue:
458
  
Inhibitor
Name:
BDBM50375449
Synonyms:
CHEMBL272755
Type:
Small organic molecule
Emp. Form.:
C15H19N3O
Mol. Mass.:
257.3309
SMILES:
C[C@H](N)Cn1ncc2ccc3oc(cc3c12)C(C)C
: