Target
Mitogen-activated protein kinase 3
Ligand
BDBM50229978
Substrate
Meas. Tech.
ChEMBL_473588 (CHEMBL939353)
Ki
310±n/a nM
Citation
 Fedorov, OMarsden, BPogacic, VRellos, PMüller, SBullock, ANSchwaller, JSundström, MKnapp, S A systematic interaction map of validated kinase inhibitors with Ser/Thr kinases. Proc Natl Acad Sci U S A 104:20523-8 (2007)  
Target
Name:
Mitogen-activated protein kinase 3
Synonyms:
ERK1 Extracellular signal-regulated kinase 1 MAP kinase ERK1 MAPK3/MAPK7 Mitogen-activated protein kinase PRKM3
Type:
Protein
Mol. Mass.:
43136.58
Organism:
Homo sapiens (Human)
Description:
curated by PDB 4QTB
Residue:
379
  
Inhibitor
Name:
BDBM50229978
Synonyms:
5-(2-PHENYLPYRAZOLO[1,5-A]PYRIDIN-3-YL)-1H-PYRAZOLO[3,4-C]PYRIDAZIN-3-AMINE 5-(2-phenylH-pyrazolo[1,5-a]pyridin-3-yl)-1H-pyrazolo[3,4-c]pyridazin-3-amine | CHEMBL259551
Type:
Small organic molecule
Emp. Form.:
C18H13N7
Mol. Mass.:
327.3427
SMILES:
Nc1n[nH]c2nnc(cc12)-c1c(nn2ccccc12)-c1ccccc1
: