Target
Non-receptor tyrosine-protein kinase TYK2
Ligand
BDBM26198
Substrate
Meas. Tech.
ChEMBL_473786 (CHEMBL937052)
IC50
1±n/a nM
Citation
 Fedorov, OMarsden, BPogacic, VRellos, PMüller, SBullock, ANSchwaller, JSundström, MKnapp, S A systematic interaction map of validated kinase inhibitors with Ser/Thr kinases. Proc Natl Acad Sci U S A 104:20523-8 (2007)  
Target
Name:
Non-receptor tyrosine-protein kinase TYK2
Synonyms:
Non-receptor tyrosine-protein kinase TYK2 (TYK2) TYK2_HUMAN | Tyrosine-protein kinase TYK2
Type:
Protein
Mol. Mass.:
133666.03
Organism:
Homo sapiens (Human)
Description:
P29597
Residue:
1187
  
Inhibitor
Name:
BDBM26198
Synonyms:
4-tert-butyl-15-fluoro-3,5,10-triazatetracyclo[11.4.0.0^{2,6}.0^{7,12}]heptadeca-1(13),2(6),3,7(12),8,14,16-heptaen-11-one Compound # 2 PDK1 inhibitor, 1 | Tetracyclic Pyridone, 1
Type:
Small organic molecule
Emp. Form.:
C18H16FN3O
Mol. Mass.:
309.3375
SMILES:
CC(C)(C)c1nc2c([nH]1)c1ccc(F)cc1c1c2cc[nH]c1=O
: