Target
RAC-alpha serine/threonine-protein kinase
Ligand
BDBM50205472
Substrate
Meas. Tech.
ChEMBL_473605 (CHEMBL939373)
Ki
>2000±n/a nM
Citation
 Fedorov, OMarsden, BPogacic, VRellos, PMüller, SBullock, ANSchwaller, JSundström, MKnapp, S A systematic interaction map of validated kinase inhibitors with Ser/Thr kinases. Proc Natl Acad Sci U S A 104:20523-8 (2007)  
Target
Name:
RAC-alpha serine/threonine-protein kinase
Synonyms:
AKT phosphorylation (p-AKT) AKT1/PPP1CA C-AKT PKB alpha Protein kinase B Protein kinase B (Akt 1) Protein kinase B alpha Proto-oncogene Akt (Akt1) Proto-oncogene c-Akt (AKT1) RAC-PK-alpha RAC-alpha serine/threonine-protein kinase (AKT1) | RAC-alpha serine/threonine-protein kinase (pAKT)
Type:
Enzyme
Mol. Mass.:
55681.25
Organism:
Homo sapiens (Human)
Description:
P31749
Residue:
480
  
Inhibitor
Name:
BDBM50205472
Synonyms:
(5Z)-5-(quinolin-6-ylmethylidene)-2-[(thiophen-2-ylmethyl)amino]-1,3-thiazol-4(5H)-one CHEMBL261644 | CHEMBL393929
Type:
Small organic molecule
Emp. Form.:
C18H13N3OS2
Mol. Mass.:
351.445
SMILES:
O=C1N=C(NCc2cccs2)SC1=Cc1ccc2ncccc2c1
: