Target
Dual specificity mitogen-activated protein kinase kinase 1
Ligand
BDBM50375656
Substrate
Meas. Tech.
ChEMBL_473844 (CHEMBL921092)
IC50
1±n/a nM
Citation
 Fedorov, OMarsden, BPogacic, VRellos, PMüller, SBullock, ANSchwaller, JSundström, MKnapp, S A systematic interaction map of validated kinase inhibitors with Ser/Thr kinases. Proc Natl Acad Sci U S A 104:20523-8 (2007)  
Target
Name:
Dual specificity mitogen-activated protein kinase kinase 1
Synonyms:
Dual specificity mitogen-activated protein kinase (MEK) Dual specificity mitogen-activated protein kinase kinase 1 (MEK1) Dual specificity mitogen-activated protein kinase kinase MEK1/2 MAP kinase kinase 1 MAPK/ERK kinase 1 MEK-1 MP2K1_HUMAN PRKMK1 | VHL-MAP2K1/MAP2K2
Type:
Other Protein Type
Mol. Mass.:
43439.03
Organism:
Homo sapiens (Human)
Description:
Full-length human MEK-1 was generated by PCR and purified as a fusion protein from Escherichia coli lysates.
Residue:
393
  
Inhibitor
Name:
BDBM50375656
Synonyms:
ARCTIGENIN
Type:
Small organic molecule
Emp. Form.:
C21H24O6
Mol. Mass.:
372.4117
SMILES:
COc1ccc(C[C@H]2COC(=O)[C@@H]2Cc2ccc(O)c(OC)c2)cc1OC
: