Target
Protein kinase C delta type
Ligand
BDBM50205472
Substrate
Meas. Tech.
ChEMBL_473694 (CHEMBL936793)
Ki
318±n/a nM
Citation
 Fedorov, OMarsden, BPogacic, VRellos, PMüller, SBullock, ANSchwaller, JSundström, MKnapp, S A systematic interaction map of validated kinase inhibitors with Ser/Thr kinases. Proc Natl Acad Sci U S A 104:20523-8 (2007)  
Target
Name:
Protein kinase C delta type
Synonyms:
KPCD_HUMAN PKCD Protein Kinase C- delta nPKC-delta
Type:
Enzyme
Mol. Mass.:
77516.79
Organism:
Homo sapiens (Human)
Description:
The recombinant human PKC enzymes were produced using a baculovirus expression system in SF9 cells
Residue:
676
  
Inhibitor
Name:
BDBM50205472
Synonyms:
(5Z)-5-(quinolin-6-ylmethylidene)-2-[(thiophen-2-ylmethyl)amino]-1,3-thiazol-4(5H)-one CHEMBL261644 | CHEMBL393929
Type:
Small organic molecule
Emp. Form.:
C18H13N3OS2
Mol. Mass.:
351.445
SMILES:
O=C1N=C(NCc2cccs2)SC1=Cc1ccc2ncccc2c1
: