Target
Cyclin-dependent kinase 2
Ligand
BDBM4622
Substrate
Meas. Tech.
ChEMBL_473631 (CHEMBL937647)
IC50
1000±n/a nM
Citation
 Fedorov, OMarsden, BPogacic, VRellos, PMüller, SBullock, ANSchwaller, JSundström, MKnapp, S A systematic interaction map of validated kinase inhibitors with Ser/Thr kinases. Proc Natl Acad Sci U S A 104:20523-8 (2007)  
Target
Name:
Cyclin-dependent kinase 2
Synonyms:
CDK2 CDK2_HUMAN Cell division protein kinase 2 Protein cereblon/Cyclin-dependent kinase 2 | p33 protein kinase
Type:
Enzyme Subunit
Mol. Mass.:
33938.17
Organism:
Homo sapiens (Human)
Description:
P24941
Residue:
298
  
Inhibitor
Name:
BDBM4622
Synonyms:
3-[(6,7-dimethoxyquinazolin-4-yl)amino]phenol CHEMBL127907
Type:
Small organic molecule
Emp. Form.:
C16H15N3O3
Mol. Mass.:
297.3086
SMILES:
COc1cc2ncnc(Nc3cccc(O)c3)c2cc1OC
: