Target
Myosin light chain kinase, smooth muscle
Ligand
BDBM15211
Substrate
Meas. Tech.
ChEMBL_473613 (CHEMBL939381)
Ki
28300±n/a nM
Citation
 Fedorov, OMarsden, BPogacic, VRellos, PMüller, SBullock, ANSchwaller, JSundström, MKnapp, S A systematic interaction map of validated kinase inhibitors with Ser/Thr kinases. Proc Natl Acad Sci U S A 104:20523-8 (2007)  
Target
Name:
Myosin light chain kinase, smooth muscle
Synonyms:
KRP MLCK MYLK MYLK_HUMAN Telokin | smMLCK
Type:
Protein
Mol. Mass.:
210702.56
Organism:
Homo sapiens (Human)
Description:
Q15746
Residue:
1914
  
Inhibitor
Name:
BDBM15211
Synonyms:
CHEMBL104264 H89 N-(2-{[(2E)-3-(4-bromophenyl)prop-2-en-1-yl]amino}ethyl)isoquinoline-5-sulfonamide | N-[2-[[(E)-3-(4-bromophenyl)prop-2-enyl]amino]ethyl]isoquinoline-5-sulfonamide
Type:
Small organic molecule
Emp. Form.:
C20H20BrN3O2S
Mol. Mass.:
446.361
SMILES:
Brc1ccc(\C=C\CNCCNS(=O)(=O)c2cccc3cnccc23)cc1
: