Target
Tyrosine-protein kinase Lck
Ligand
BDBM50142887
Substrate
Meas. Tech.
ChEMBL_473555 (CHEMBL939225)
IC50
4±n/a nM
Citation
 Fedorov, OMarsden, BPogacic, VRellos, PMüller, SBullock, ANSchwaller, JSundström, MKnapp, S A systematic interaction map of validated kinase inhibitors with Ser/Thr kinases. Proc Natl Acad Sci U S A 104:20523-8 (2007)  
Target
Name:
Tyrosine-protein kinase Lck
Synonyms:
2.7.10.2 LCK_HUMAN Leukocyte C-terminal Src kinase Lymphocyte-specific protein tyrosine kinase Protein YT16 Proto-oncogene tyrosine-protein kinase LCK T cell-specific protein-tyrosine kinase
Type:
Mol. Mass.:
57987.83
Organism:
Homo sapiens (Human)
Description:
P06239
Residue:
509
  
Inhibitor
Name:
BDBM50142887
Synonyms:
1-(tert-butyl)-3-(4-chlorophenyl)-4-aminopyrazolo[3,4-d]pyrimidine 1-tert-butyl-3-(4-chlorophenyl)-1H-pyrazolo[3,4-d]pyrimidin-4-amine 4-amino-5-(4-chlorophenyl)-7-(tert-butyl)pyrazolo[3,4-d]pyrimidine CHEMBL406845 US10544104, Compound 146 US11701353, PP2 (Pfizer) cid_4878
Type:
Small organic molecule
Emp. Form.:
C15H16ClN5
Mol. Mass.:
301.774
SMILES:
CC(C)(C)n1nc(-c2ccc(Cl)cc2)c2c(N)ncnc12
: