Target
Mu-type opioid receptor
Ligand
BDBM50375695
Substrate
Meas. Tech.
ChEMBL_473942 (CHEMBL950322)
IC50
>10000±n/a nM
Citation
 Ryu, EKWu, ZChen, KLazarus, LHMarczak, EDSasaki, YAmbo, ASalvadori, SRen, CZhao, HBalboni, GChen, X Synthesis of a potent and selective (18)F-labeled delta-opioid receptor antagonist derived from the Dmt-Tic pharmacophore for positron emission tomography imaging. J Med Chem 51:1817-23 (2008)  
Target
Name:
Mu-type opioid receptor
Synonyms:
M-OR-1 Mu opioid receptor OPIATE Mu OPRM_CAVPO
Type:
Enzyme Catalytic Domain
Mol. Mass.:
11165.58
Organism:
GUINEA PIG
Description:
P97266
Residue:
98
  
Inhibitor
Name:
BDBM50375695
Synonyms:
CHEMBL270984
Type:
Small organic molecule
Emp. Form.:
C43H49N5O9
Mol. Mass.:
779.8773
SMILES:
Cc1cc(O)cc(O)c1C[C@H](N)C(=O)N1Cc2ccccc2C[C@@H]1C(=O)N[C@@H](Cc1ccccc1)C(=O)N[C@@H](CCCCNC(=O)OCc1ccccc1)C(O)=O
: