Target
Progesterone receptor
Ligand
BDBM50375823
Substrate
Meas. Tech.
ChEMBL_474421 (CHEMBL934254)
EC50
3000±n/a nM
Citation
 Fensome, AAdams, WRAdams, ALBerrodin, TJCohen, JHuselton, CIllenberger, AKern, JCHudak, VAMarella, MAMelenski, EGMcComas, CCMugford, CASlayden, ODYudt, MZhang, ZZhang, PZhu, YWinneker, RCWrobel, JE Design, synthesis, and SAR of new pyrrole-oxindole progesterone receptor modulators leading to 5-(7-fluoro-3,3-dimethyl-2-oxo-2,3-dihydro-1H-indol-5-yl)-1-methyl-1H-pyrrole-2-carbonitrile (WAY-255348). J Med Chem 51:1861-73 (2008)  
Target
Name:
Progesterone receptor
Synonyms:
NR3C3 PGR PRGR_HUMAN | progesterone
Type:
Protein
Mol. Mass.:
98979.52
Organism:
Homo sapiens (Human)
Description:
P06401
Residue:
933
  
Inhibitor
Name:
BDBM50375823
Synonyms:
CHEMBL407847
Type:
Small organic molecule
Emp. Form.:
C18H16FN3O
Mol. Mass.:
309.3375
SMILES:
Cn1c(ccc1-c1cc2c(NC(=O)C22CCCC2)c(F)c1)C#N
: