Target
Progesterone receptor
Ligand
BDBM50375826
Substrate
Meas. Tech.
ChEMBL_474422 (CHEMBL934255)
IC50
5.9±n/a nM
Citation
 Fensome, AAdams, WRAdams, ALBerrodin, TJCohen, JHuselton, CIllenberger, AKern, JCHudak, VAMarella, MAMelenski, EGMcComas, CCMugford, CASlayden, ODYudt, MZhang, ZZhang, PZhu, YWinneker, RCWrobel, JE Design, synthesis, and SAR of new pyrrole-oxindole progesterone receptor modulators leading to 5-(7-fluoro-3,3-dimethyl-2-oxo-2,3-dihydro-1H-indol-5-yl)-1-methyl-1H-pyrrole-2-carbonitrile (WAY-255348). J Med Chem 51:1861-73 (2008)  
Target
Name:
Progesterone receptor
Synonyms:
NR3C3 PGR PRGR_HUMAN | progesterone
Type:
Protein
Mol. Mass.:
98979.52
Organism:
Homo sapiens (Human)
Description:
P06401
Residue:
933
  
Inhibitor
Name:
BDBM50375826
Synonyms:
CHEMBL270714
Type:
Small organic molecule
Emp. Form.:
C16H14FN3O
Mol. Mass.:
283.3003
SMILES:
Cn1c(ccc1-c1ccc2NC(=O)C(C)(C)c2c1F)C#N
: