Target
RmtA
Ligand
BDBM50376164
Substrate
Meas. Tech.
ChEMBL_475539 (CHEMBL925748)
IC50
37000±n/a nM
Citation
 Mai, ACheng, DBedford, MTValente, SNebbioso, APerrone, ABrosch, GSbardella, GDe Bellis, FMiceli, MAltucci, L epigenetic multiple ligands: mixed histone/protein methyltransferase, acetyltransferase, and class III deacetylase (sirtuin) inhibitors. J Med Chem 51:2279-90 (2008)  
Target
Name:
RmtA
Synonyms:
Type:
PROTEIN
Mol. Mass.:
39351.26
Organism:
Emericella nidulans
Description:
ChEMBL_475539
Residue:
345
  
Inhibitor
Name:
BDBM50376164
Synonyms:
CHEMBL265453
Type:
Small organic molecule
Emp. Form.:
C24H14Br4O4
Mol. Mass.:
685.982
SMILES:
Oc1c(Br)cc(\C=C\C(=O)c2ccc(cc2)C(=O)\C=C\c2cc(Br)c(O)c(Br)c2)cc1Br
: