Target
Glucagon-like peptide 1 receptor
Ligand
BDBM50087746
Substrate
Meas. Tech.
ChEMBL_476876 (CHEMBL940048)
EC50
0.008±n/a nM
Citation
 Knudsen, LBKiel, DTeng, MBehrens, CBhumralkar, DKodra, JTHolst, JJJeppesen, CBJohnson, MDde Jong, JCJorgensen, ASKercher, TKostrowicki, JMadsen, POlesen, PHPetersen, JSPoulsen, FSidelmann, UGSturis, JTruesdale, LMay, JLau, J Small-molecule agonists for the glucagon-like peptide 1 receptor. Proc Natl Acad Sci U S A 104:937-42 (2007)  
Target
Name:
Glucagon-like peptide 1 receptor
Synonyms:
GLP-1 receptor GLP-1R GLP1R_HUMAN Glucagon-like peptide 1 receptor (GLP-1)
Type:
Enzyme
Mol. Mass.:
53035.78
Organism:
Homo sapiens (Human)
Description:
P43220
Residue:
463
  
Inhibitor
Name:
BDBM50087746
Synonyms:
CHEMBL428139 Glucagon like peptide-1(GLP-1)
Type:
Small organic molecule
Emp. Form.:
C151H228N40O47
Mol. Mass.:
3355.6658
SMILES:
CC[C@H](C)[C@H](NC(=O)[C@H](Cc1ccccc1)NC(=O)[C@H](CCC(O)=O)NC(=O)[C@H](CCCCN)NC(=O)[C@H](C)NC(=O)[C@H](C)NC(=O)[C@H](CCC(N)=O)NC(=O)CNC(=O)[C@H](CCC(O)=O)NC(=O)[C@H](CC(C)C)NC(=O)[C@H](Cc1ccc(O)cc1)NC(=O)[C@H](CO)NC(=O)[C@H](CO)NC(=O)[C@@H](NC(=O)[C@H](CC(O)=O)NC(=O)[C@H](CO)NC(=O)[C@@H](NC(=O)[C@H](Cc1ccccc1)NC(=O)[C@@H](NC(=O)CNC(=O)[C@H](CCC(O)=O)NC(=O)[C@H](C)NC(=O)[C@@H](N)Cc1cnc[nH]1)[C@@H](C)O)[C@@H](C)O)C(C)C)C(=O)N[C@@H](C)C(=O)N[C@@H](Cc1c[nH]c2ccccc12)C(=O)N[C@@H](CC(C)C)C(=O)N[C@@H](C(C)C)C(=O)N[C@@H](CCCCN)C(=O)NCC(=O)N[C@@H](CCCNC(N)=N)C(=O)NCC(O)=O
: