Target
C5a anaphylatoxin chemotactic receptor 1
Ligand
BDBM50376802
Substrate
Meas. Tech.
ChEMBL_477917 (CHEMBL923542)
Ki
35±n/a nM
Citation
 Barbay, JKGong, YBuntinx, MLi, JClaes, CHornby, PJVan Lommen, GVan Wauwe, JHe, W Synthesis and characterization of 5,6,7,8-tetrahydroquinoline C5a receptor antagonists. Bioorg Med Chem Lett 18:2544-8 (2008)  
Target
Name:
C5a anaphylatoxin chemotactic receptor 1
Synonyms:
C5AR C5AR1_HUMAN C5a anaphylatoxin chemotactic receptor C5a-R | CD_antigen=CD88
Type:
Enzyme
Mol. Mass.:
39347.68
Organism:
Homo sapiens (Human)
Description:
P21730
Residue:
350
  
Inhibitor
Name:
BDBM50376802
Synonyms:
CHEMBL258658
Type:
Small organic molecule
Emp. Form.:
C29H34N2O
Mol. Mass.:
426.5931
SMILES:
CCc1cccc(CC)c1-c1cc(OC)c2C(CCCc2n1)N1CCc2ccccc2C1
: