Target
Mu-type opioid receptor
Ligand
BDBM50238615
Substrate
Meas. Tech.
ChEMBL_477925 (CHEMBL923550)
Ki
10±n/a nM
Citation
 Tidgewell, KGroer, CEHarding, WWLozama, ASchmidt, MMarquam, AHiemstra, JPartilla, JSDersch, CMRothman, RBBohn, LMPrisinzano, TE Herkinorin analogues with differential beta-arrestin-2 interactions. J Med Chem 51:2421-31 (2008)  
Target
Name:
Mu-type opioid receptor
Synonyms:
M-OR-1 MOR-1 MUOR1 Mu opiate receptor OPRM1 hMOP | mu-type opioid receptor isoform MOR-1
Type:
G Protein-Coupled Receptor (GPCR)
Mol. Mass.:
44789.51
Organism:
Homo sapiens (Human)
Description:
P35372
Residue:
400
  
Inhibitor
Name:
BDBM50238615
Synonyms:
CHEMBL264967 Thiophene-3-carboxylic Acid (2S,4aR,6aR,7R,9S,10aS,10bR)-7-Carbomethoxy-2-(3-furanyl)dodecahydro-6a,10b-dimethyl-4,10-dioxo-2H-naphtho[2,1-c]pyran-9-yl Ester
Type:
Small organic molecule
Emp. Form.:
C26H28O8S
Mol. Mass.:
500.561
SMILES:
COC(=O)[C@@H]1C[C@H](OC(=O)c2cccs2)C(=O)[C@H]2[C@@]1(C)CC[C@H]1C(=O)O[C@@H](C[C@]21C)c1ccoc1
: