Target
Progesterone receptor
Ligand
BDBM50376852
Substrate
Meas. Tech.
ChEMBL_478381 (CHEMBL931333)
Ki
866±n/a nM
Citation
 Miner, JNArdecky, BBenbatoul, KGriffiths, KLarson, CJMais, DEMarschke, KRosen, JVajda, EZhi, LNegro-Vilar, A Antiinflammatory glucocorticoid receptor ligand with reduced side effects exhibits an altered protein-protein interaction profile. Proc Natl Acad Sci U S A 104:19244-9 (2007)  
Target
Name:
Progesterone receptor
Synonyms:
NR3C3 PGR PRGR_HUMAN | progesterone
Type:
Protein
Mol. Mass.:
98979.52
Organism:
Homo sapiens (Human)
Description:
P06401
Residue:
933
  
Inhibitor
Name:
BDBM50376852
Synonyms:
CHEMBL259820 | LGD-5552
Type:
Small organic molecule
Emp. Form.:
C28H26FNO3
Mol. Mass.:
443.5093
SMILES:
COc1c(O)ccc2O\C(=C/c3cccc(C)c3F)c3c(ccc4NC(C)(C)C=C(C)c34)-c12
: