Target
Androgen receptor
Ligand
BDBM50376852
Substrate
Meas. Tech.
ChEMBL_478382 (CHEMBL931334)
Ki
910±n/a nM
Citation
 Miner, JNArdecky, BBenbatoul, KGriffiths, KLarson, CJMais, DEMarschke, KRosen, JVajda, EZhi, LNegro-Vilar, A Antiinflammatory glucocorticoid receptor ligand with reduced side effects exhibits an altered protein-protein interaction profile. Proc Natl Acad Sci U S A 104:19244-9 (2007)  
Target
Name:
Androgen receptor
Synonyms:
ANDR_HUMAN Androgen Receptor Androgen receptor/Baculoviral IAP repeat-containing protein 2 Dihydrotestosterone receptor Nuclear receptor subfamily 3 group C member 4
Type:
Receptor
Mol. Mass.:
99185.27
Organism:
Homo sapiens (Human)
Description:
CHO cells were stably transfected with human AR gene.
Residue:
920
  
Inhibitor
Name:
BDBM50376852
Synonyms:
CHEMBL259820 | LGD-5552
Type:
Small organic molecule
Emp. Form.:
C28H26FNO3
Mol. Mass.:
443.5093
SMILES:
COc1c(O)ccc2O\C(=C/c3cccc(C)c3F)c3c(ccc4NC(C)(C)C=C(C)c34)-c12
: