Target
Macrophage colony-stimulating factor 1 receptor
Ligand
BDBM50377060
Substrate
Meas. Tech.
ChEMBL_479297 (CHEMBL933669)
IC50
0.8±n/a nM
Citation
 Meegalla, SKWall, MJChen, JWilson, KJBallentine, SKDesjarlais, RLSchubert, CCrysler, CSChen, YMolloy, CJChaikin, MAManthey, CLPlayer, MRTomczuk, BEIllig, CR Structure-based optimization of a potent class of arylamide FMS inhibitors. Bioorg Med Chem Lett 18:3632-7 (2008)  
Target
Name:
Macrophage colony-stimulating factor 1 receptor
Synonyms:
CSF1R FMS Macrophage colony stimulating factor receptor Macrophage colony-stimulating factor 1 receptor (c-FMS) Proto-oncogene c-Fms c-fms | cFMS
Type:
Protein
Mol. Mass.:
107979.48
Organism:
Homo sapiens (Human)
Description:
P07333
Residue:
972
  
Inhibitor
Name:
BDBM50377060
Synonyms:
CHEMBL255443
Type:
Small organic molecule
Emp. Form.:
C23H26N4O2
Mol. Mass.:
390.4781
SMILES:
CC1CCN(CC1)c1cc(ccc1NC(=O)c1ccc(o1)C#N)C1=CCNCC1
: