Target
Glucocorticoid receptor
Ligand
BDBM50086551
Substrate
Meas. Tech.
ChEMBL_479540 (CHEMBL931536)
Ki
43±n/a nM
Citation
 Roach, SLHiguchi, RIAdams, MELiu, YKaranewsky, DSMarschke, KBMais, DEMiner, JNZhi, L Discovery of nonsteroidal glucocorticoid receptor ligands based on 6-indole-1,2,3,4-tetrahydroquinolines. Bioorg Med Chem Lett 18:3504-8 (2008)  
Target
Name:
Glucocorticoid receptor
Synonyms:
GCR_HUMAN GRL Glucocorticoid receptor (GRFP) Nuclear receptor subfamily 3 group C member 1
Type:
Enzyme
Mol. Mass.:
85656.87
Organism:
Homo sapiens (Human)
Description:
P04150
Residue:
777
  
Inhibitor
Name:
BDBM50086551
Synonyms:
4-Methyl-5-(2,2,4-trimethyl-1,2,3,4-tetrahydro-quinolin-6-yl)-thiophene-2-carbonitrile racemic-4-methyl-5-(2,2,4-trimethyl-1,2,3,4-tetrahydroquinolin-6-yl)thiophene-2-carbonitrile
Type:
Small organic molecule
Emp. Form.:
C18H20N2S
Mol. Mass.:
296.43
SMILES:
CC1CC(C)(C)Nc2ccc(cc12)-c1sc(cc1C)C#N
: