Target
Prothrombin
Ligand
BDBM50149023
Substrate
Meas. Tech.
ChEMBL_479759 (CHEMBL934691)
Ki
4±n/a nM
Citation
 Kreutter, KDLu, TLee, LGiardino, ECPatel, SHuang, HXu, GFitzgerald, MHaertlein, BJMohan, VCrysler, CEisennagel, SDasgupta, MMcMillan, MSpurlino, JCHuebert, NDMaryanoff, BETomczuk, BEDamiano, BPPlayer, MR Orally efficacious thrombin inhibitors with cyanofluorophenylacetamide as the P2 motif. Bioorg Med Chem Lett 18:2865-70 (2008)  
Target
Name:
Prothrombin
Synonyms:
Activation peptide fragment 1 Coagulation factor II Prothrombin precursor Thrombin heavy chain | Thrombin light chain
Type:
Protein
Mol. Mass.:
70029.57
Organism:
Homo sapiens (Human)
Description:
P00734
Residue:
622
  
Inhibitor
Name:
BDBM50149023
Synonyms:
3-{[1-({[(diaminomethylidene)amino]oxy}methyl)cyclopropyl]methoxy}-N-(furan-3-ylmethyl)-5-methyl-N-propylbenzamide Oxyguanidine derivative
Type:
Small organic molecule
Emp. Form.:
C22H30N4O4
Mol. Mass.:
414.498
SMILES:
CCCN(Cc1ccoc1)C(=O)c1cc(C)cc(OCC2(CONC(N)=N)CC2)c1
: