Target
Prothrombin
Ligand
BDBM50377616
Substrate
Meas. Tech.
ChEMBL_479759 (CHEMBL934691)
Ki
3.2±n/a nM
Citation
 Kreutter, KDLu, TLee, LGiardino, ECPatel, SHuang, HXu, GFitzgerald, MHaertlein, BJMohan, VCrysler, CEisennagel, SDasgupta, MMcMillan, MSpurlino, JCHuebert, NDMaryanoff, BETomczuk, BEDamiano, BPPlayer, MR Orally efficacious thrombin inhibitors with cyanofluorophenylacetamide as the P2 motif. Bioorg Med Chem Lett 18:2865-70 (2008)  
Target
Name:
Prothrombin
Synonyms:
Activation peptide fragment 1 Coagulation factor II Prothrombin precursor Thrombin heavy chain | Thrombin light chain
Type:
Protein
Mol. Mass.:
70029.57
Organism:
Homo sapiens (Human)
Description:
P00734
Residue:
622
  
Inhibitor
Name:
BDBM50377616
Synonyms:
CHEMBL258198
Type:
Small organic molecule
Emp. Form.:
C20H20F4N6O2
Mol. Mass.:
452.4054
SMILES:
[#7]\[#6](-[#7])=[#7]\[#8]-[#6]-[#6]-[#7]-[#6](=O)-[#6]-c1c(F)c(-[#7]-[#6]C(F)(F)c2cccc(F)c2)ccc1C#N
: