Target
Adenosine receptor A2a
Ligand
BDBM50163020
Substrate
Meas. Tech.
ChEMBL_479903 (CHEMBL935756)
Ki
10400±n/a nM
Citation
 Melman, AGao, ZGKumar, DWan, TCGizewski, EAuchampach, JAJacobson, KA Design of (N)-methanocarba adenosine 5'-uronamides as species-independent A3 receptor-selective agonists. Bioorg Med Chem Lett 18:2813-9 (2008)  
Target
Name:
Adenosine receptor A2a
Synonyms:
AA2AR_MOUSE Adenosine receptor A2a | Adora2a
Type:
PROTEIN
Mol. Mass.:
44984.04
Organism:
Mus musculus
Description:
ChEMBL_479903
Residue:
410
  
Inhibitor
Name:
BDBM50163020
Synonyms:
(1S,2R,3S,4R,5S)-4-(6-(3-chlorobenzylamino)-2-chloro-9H-purin-9-yl)-2,3-dihydroxy-N-methylbicyclo[3.1.0]hexane-1-carboxamide 1N-methyl-4-[2-chloro-6-(3-chlorobenzylamino)-9H-9-purinyl]-2,3-dihydroxy-(1S,2R,3S,4R,5S)-bicyclo[3.1.0]hexane-1-carboxamide | CHEMBL175543
Type:
Small organic molecule
Emp. Form.:
C20H20Cl2N6O3
Mol. Mass.:
463.317
SMILES:
CNC(=O)[C@@]12C[C@@H]1[C@H]([C@H](O)[C@@H]2O)n1cnc2c(NCc3cccc(Cl)c3)nc(Cl)nc12
: