Target
Adenosine receptor A1
Ligand
BDBM50163004
Substrate
Meas. Tech.
ChEMBL_479902 (CHEMBL935755)
Ki
6.6±n/a nM
Citation
 Melman, AGao, ZGKumar, DWan, TCGizewski, EAuchampach, JAJacobson, KA Design of (N)-methanocarba adenosine 5'-uronamides as species-independent A3 receptor-selective agonists. Bioorg Med Chem Lett 18:2813-9 (2008)  
Target
Name:
Adenosine receptor A1
Synonyms:
AA1R_MOUSE Adenosine receptor A1 | Adora1
Type:
PROTEIN
Mol. Mass.:
36646.06
Organism:
Mus musculus
Description:
ChEMBL_479902
Residue:
326
  
Inhibitor
Name:
BDBM50163004
Synonyms:
(1S,2R,3S,4R,5S)-4-(2-chloro-6-(2-phenylcyclopropylamino)-9H-purin-9-yl)-2,3-dihydroxy-N-methylbicyclo[3.1.0]hexane-1-carboxamide CHEMBL411861
Type:
Small organic molecule
Emp. Form.:
C22H23ClN6O3
Mol. Mass.:
454.909
SMILES:
CNC(=O)[C@]12C[C@@H]1[C@H]([C@H](O)[C@@H]2O)n1cnc2c(NC3CC3c3ccccc3)nc(Cl)nc12
: