Target
Adenosine receptor A3
Ligand
BDBM50163017
Substrate
Meas. Tech.
ChEMBL_479904 (CHEMBL935757)
Ki
1.9±n/a nM
Citation
 Melman, AGao, ZGKumar, DWan, TCGizewski, EAuchampach, JAJacobson, KA Design of (N)-methanocarba adenosine 5'-uronamides as species-independent A3 receptor-selective agonists. Bioorg Med Chem Lett 18:2813-9 (2008)  
Target
Name:
Adenosine receptor A3
Synonyms:
A3AR Adenosine A3 receptor Gpcr2
Type:
PROTEIN
Mol. Mass.:
36460.91
Organism:
Mus musculus
Description:
ChEMBL_1515686
Residue:
319
  
Inhibitor
Name:
BDBM50163017
Synonyms:
(1S,2R,3S,4R,5S)-4-(6-(3-(3-hydroxyprop-1-ynyl)benzylamino)-2-chloro-9H-purin-9-yl)-2,3-dihydroxy-N-methylbicyclo[3.1.0]hexane-1-carboxamide CHEMBL178644
Type:
Small organic molecule
Emp. Form.:
C23H23ClN6O4
Mol. Mass.:
482.92
SMILES:
CNC(=O)[C@]12C[C@@H]1[C@H]([C@H](O)[C@@H]2O)n1cnc2c(NCc3cccc(c3)C#CCO)nc(Cl)nc12
: