Target
Histone deacetylase 6
Ligand
BDBM19130
Substrate
Meas. Tech.
ChEMBL_479926 (CHEMBL929249)
Ki
0.13±n/a nM
Citation
 Mazitschek, RPatel, VWirth, DFClardy, J Development of a fluorescence polarization based assay for histone deacetylase ligand discovery. Bioorg Med Chem Lett 18:2809-12 (2008)  
Target
Name:
Histone deacetylase 6
Synonyms:
Cereblon/Histone deacetylase 6 HDAC6 Histone deacetylase 6 (HDAC6) KIAA0901 | ORF Names:JM21
Type:
Chromatin regulator; hydrolase; repressor
Mol. Mass.:
131381.51
Organism:
Homo sapiens (Human)
Description:
Q9UBN7
Residue:
1215
  
Inhibitor
Name:
BDBM19130
Synonyms:
(2E,4E,6R)-7-[4-(dimethylamino)phenyl]-N-hydroxy-4,6-dimethyl-7-oxohepta-2,4-dienamide TSA | Trichostatin A (TSA)
Type:
Small organic molecule
Emp. Form.:
C17H22N2O3
Mol. Mass.:
302.3682
SMILES:
CC(C=CC(=O)NO)C=C(C)C(=O)c1ccc(cc1)N(C)C
: