Target
Prostaglandin G/H synthase 2
Ligand
BDBM50339185
Substrate
Meas. Tech.
ChEMBL_550431 (CHEMBL1003453)
IC50
1010000±n/a nM
Citation
 Ringbom, TSegura, LNoreen, YPerera, PBohlin, L Ursolic acid from Plantago major, a selective inhibitor of cyclooxygenase-2 catalyzed prostaglandin biosynthesis. J Nat Prod 61:1212-5 (1998)  
Target
Name:
Prostaglandin G/H synthase 2
Synonyms:
COX2 Cyclooxygenase 2 (COX-2) Cyclooxygenase-2 (COX-2 AA) Cyclooxygenase-2 (COX-2) PGH2_HUMAN PHS II Prostaglandin E synthase/G/H synthase 2 Prostaglandin-endoperoxide synthase 2
Type:
Enzyme
Mol. Mass.:
69003.89
Organism:
Homo sapiens (Human)
Description:
Recombinant Cox-2 provided by Cayman (Cayman Chemical Co.,Ann Arbor, MI).
Residue:
604
  
Inhibitor
Name:
BDBM50339185
Synonyms:
(2S)-2-(6-methoxynaphthalen-2-yl)propanoic acid (S)-2-(6-methoxynaphthalen-2-yl)propanoic acid 2-(6-Methoxy-naphthalen-2-yl)-propionic acid 2-(6-methoxy-2-naphthyl)propanoic acid Aleve CHEMBL154 Equiproxen Naprosyn Naproxen2-(6-Methoxy-naphthalen-2-yl)-propionic acid S-NAPROXEN naproxene
Type:
Small organic molecule
Emp. Form.:
C14H14O3
Mol. Mass.:
230.2592
SMILES:
COc1ccc2cc(ccc2c1)[C@H](C)C(O)=O
: