Target
NT-3 growth factor receptor
Ligand
BDBM482158
Substrate
Meas. Tech.
ChEMBL_531127 (CHEMBL974013)
EC50
>1000±n/a nM
Citation
 McDermott, USharma, SVDowell, LGreninger, PMontagut, CLamb, JArchibald, HRaudales, RTam, ALee, DRothenberg, SMSupko, JGSordella, RUlkus, LEIafrate, AJMaheswaran, SNjauw, CNTsao, HDrew, LHanke, JHMa, XJErlander, MGGray, NSHaber, DASettleman, J Identification of genotype-correlated sensitivity to selective kinase inhibitors by using high-throughput tumor cell line profiling. Proc Natl Acad Sci U S A 104:19936-41 (2007)  
Target
Name:
NT-3 growth factor receptor
Synonyms:
GP145-TrkC NTRK3_HUMAN Neurotrophic tyrosine kinase receptor type 3 Trk-C Tyrosine kinase receptor C (Trk-C)
Type:
Enzyme
Mol. Mass.:
94428.15
Organism:
Homo sapiens (Human)
Description:
Q16288
Residue:
839
  
Inhibitor
Name:
BDBM482158
Synonyms:
BDBM50242742 | TAE684
Type:
Emp. Form.:
C30H40ClN7O3S
Mol. Mass.:
614.202
SMILES:
COc1cc(ccc1Nc1ncc(Cl)c(Nc2ccccc2S(=O)(=O)C(C)C)n1)N1CCC(CC1)N1CCN(C)CC1
: