Target
Cannabinoid receptor 1
Ligand
BDBM50260750
Substrate
Meas. Tech.
ChEMBL_552268 (CHEMBL995598)
Ki
3010±n/a nM
Citation
 Omura, HKawai, MShima, AIwata, YIto, FMasuda, TOhta, AMakita, NOmoto, KSugimoto, HKikuchi, AIwata, HAndo, K The SAR studies of novel CB2 selective agonists, benzimidazolone derivatives. Bioorg Med Chem Lett 18:3310-4 (2008)  
Target
Name:
Cannabinoid receptor 1
Synonyms:
CANN6 CB-R CNR CNR1_HUMAN Cannabinoid receptor Cannabinoid receptor 1 (brain)
Type:
G Protein-Coupled Receptor (GPCR)
Mol. Mass.:
52868.96
Organism:
Homo sapiens (Human)
Description:
P21554
Residue:
472
  
Inhibitor
Name:
BDBM50260750
Synonyms:
(S)-N-(1-amino-3,3-dimethyl-1-oxobutan-2-yl)-3-((4-hydroxy-tetrahydro-2H-pyran-4-yl)methyl)-2-oxo-2,3-dihydrobenzo[d]imidazole-1-carboxamide | CHEMBL522906
Type:
Small organic molecule
Emp. Form.:
C20H28N4O5
Mol. Mass.:
404.4601
SMILES:
CC(C)(C)[C@H](NC(=O)n1c2ccccc2n(CC2(O)CCOCC2)c1=O)C(N)=O
: