Target
Cannabinoid receptor 1
Ligand
BDBM50377918
Substrate
Meas. Tech.
ChEMBL_552268 (CHEMBL995598)
Ki
1470±n/a nM
Citation
 Omura, HKawai, MShima, AIwata, YIto, FMasuda, TOhta, AMakita, NOmoto, KSugimoto, HKikuchi, AIwata, HAndo, K The SAR studies of novel CB2 selective agonists, benzimidazolone derivatives. Bioorg Med Chem Lett 18:3310-4 (2008)  
Target
Name:
Cannabinoid receptor 1
Synonyms:
CANN6 CB-R CNR CNR1_HUMAN Cannabinoid receptor Cannabinoid receptor 1 (brain)
Type:
G Protein-Coupled Receptor (GPCR)
Mol. Mass.:
52868.96
Organism:
Homo sapiens (Human)
Description:
P21554
Residue:
472
  
Inhibitor
Name:
BDBM50377918
Synonyms:
CHEMBL1162994
Type:
Small organic molecule
Emp. Form.:
C21H30N4O4
Mol. Mass.:
402.4873
SMILES:
CC(C)(C)C(NC(=O)n1c2ccccc2n(CCC2CCOCC2)c1=O)C(N)=O
: